Target
Kappa-type opioid receptor
Ligand
BDBM62201
Substrate
Meas. Tech.
SAR analysis of Agonists of the Kappa Opioid Receptor (KOR) using an Image-Based Assay
EC50
>32000±n/a nM
Citation
 PubChem, PC SAR analysis of Agonists of the Kappa Opioid Receptor (KOR) using an Image-Based Assay PubChem Bioassay (2010)[AID] 
Target
Name:
Kappa-type opioid receptor
Synonyms:
K-OR-1 Kappa-opioid receptor (KOR) Kappa-type opioid receptor (KOR) OPIATE Kappa OPRK1 kappa opioid receptor (KOR)
Type:
G Protein-Coupled Receptor (GPCR)
Mol. Mass.:
42648.76
Organism:
Homo sapiens (Human)
Description:
P41145
Residue:
380
  
Inhibitor
Name:
BDBM62201
Synonyms:
4-methoxy-N-[[4-[4-(phenylmethyl)piperazin-1-yl]carbonylphenyl]methyl]benzenesulfonamide MLS-0364353.0001 N-[[4-(4-benzylpiperazine-1-carbonyl)phenyl]methyl]-4-methoxybenzenesulfonamide | cid_20854208
Type:
Small organic molecule
Emp. Form.:
C26H29N3O4S
Mol. Mass.:
479.591
SMILES:
COc1ccc(cc1)S(=O)(=O)NCc1ccc(cc1)C(=O)N1CCN(Cc2ccccc2)CC1
: