Target
Trans-activator protein BZLF1
Ligand
BDBM61709
Substrate
Meas. Tech.
Counterscreen for inhibitors of EBNA-1: fluorescence polarization-based biochemical high throughput dose response assay to identify inhibitors of the Epstein-Barr virus-encoded protein, ZTA
IC50
15112±n/a nM
Citation
 PubChem, PC Counterscreen for inhibitors of EBNA-1: fluorescence polarization-based biochemical high throughput dose response assay to identify inhibitors of the Epstein-Barr virus-encoded protein, ZTA PubChem Bioassay (2010)[AID] 
Target
Name:
Trans-activator protein BZLF1
Synonyms:
BZLF1 PPP5C protein
Type:
Enzyme Catalytic Domain
Mol. Mass.:
26856.37
Organism:
Human herpesvirus 4
Description:
gi_82503229
Residue:
245
  
Inhibitor
Name:
BDBM61709
Synonyms:
4-[2,5-bis(oxidanylidene)pyrrolidin-1-yl]-N-(6,7-dihydro-[1,4]dioxino[2,3-f][1,3]benzothiazol-2-yl)benzamide N-(6,7-dihydro-[1,4]dioxino[2,3-f][1,3]benzothiazol-2-yl)-4-(2,5-dioxo-1-pyrrolidinyl)benzamide N-(6,7-dihydro-[1,4]dioxino[2,3-f][1,3]benzothiazol-2-yl)-4-succinimido-benzamide cid_7202836
Type:
Small organic molecule
Emp. Form.:
C20H15N3O5S
Mol. Mass.:
409.415
SMILES:
Oc1ccc(O)n1-c1ccc(cc1)C(=O)Nc1nc2cc3OCCOc3cc2s1
: