Target
Heat shock factor protein 1
Ligand
BDBM62634
Substrate
Meas. Tech.
Luminescence Cell-Based Dose Confimation HTS to Identify Inhibitors of Heat Shock Factor 1 (HSF1)
EC50
>195000±0 nM
Citation
 PubChem, PC Luminescence Cell-Based Dose Confimation HTS to Identify Inhibitors of Heat Shock Factor 1 (HSF1) PubChem Bioassay (2010)[AID] 
Target
Name:
Heat shock factor protein 1
Synonyms:
HSF1_MOUSE Hsf1 protein
Type:
Enzyme Catalytic Domain
Mol. Mass.:
57208.68
Organism:
Mus musculus
Description:
P38532
Residue:
525
  
Inhibitor
Name:
BDBM62634
Synonyms:
(7-bromanyl-4-oxidanylidene-pyrido[1,2-a]pyrimidin-2-yl)methyl 2,3-dihydro-1,4-benzodioxine-3-carboxylate 2,3-dihydro-1,4-benzodioxin-3-carboxylic acid (7-bromo-4-keto-pyrido[1,2-a]pyrimidin-2-yl)methyl ester MLS000057295 cid_2999034
Type:
Small organic molecule
Emp. Form.:
C18H13BrN2O5
Mol. Mass.:
417.21
SMILES:
Brc1ccc2nc(COC(=O)C3COc4ccccc4O3)cc(=O)n2c1
: