Target
Heat shock factor protein 1
Ligand
BDBM50303403
Substrate
Meas. Tech.
Luminescence Cell-Based Dose Confimation HTS to Identify Inhibitors of Heat Shock Factor 1 (HSF1)
EC50
>195000±0 nM
Citation
 PubChem, PC Luminescence Cell-Based Dose Confimation HTS to Identify Inhibitors of Heat Shock Factor 1 (HSF1) PubChem Bioassay (2010)[AID] 
Target
Name:
Heat shock factor protein 1
Synonyms:
HSF1_MOUSE Hsf1 protein
Type:
Enzyme Catalytic Domain
Mol. Mass.:
57208.68
Organism:
Mus musculus
Description:
P38532
Residue:
525
  
Inhibitor
Name:
BDBM50303403
Synonyms:
2-(4-methyl-2-oxo-2H-chromen-7-yloxy)acetonitrile cid_1633306
Type:
Small organic molecule
Emp. Form.:
C12H9NO3
Mol. Mass.:
215.2048
SMILES:
Cc1cc(=O)oc2cc(OCC#N)ccc12
: