Target
G-protein coupled receptor 55
Ligand
BDBM64818
Substrate
Meas. Tech.
SAR Analysis of Selective Antagonists of GPR55 using an Image-Based Assay
IC50
>32000±n/a nM
Citation
 PubChem, PC SAR Analysis of Selective Antagonists of GPR55 using an Image-Based Assay PubChem Bioassay (2010)[AID] 
Target
Name:
G-protein coupled receptor 55
Synonyms:
G protein-coupled receptor 55 GPR55_HUMAN
Type:
PROTEIN
Mol. Mass.:
36649.72
Organism:
Homo sapiens (Human)
Description:
ChEMBL_1292265
Residue:
319
  
Inhibitor
Name:
BDBM64818
Synonyms:
4-[[2-[1-(4-chloroanilino)-1-oxobutan-2-yl]sulfanyl-4-oxothieno[3,2-d]pyrimidin-3-yl]methyl]benzoic acid 4-[[2-[1-[(4-chlorophenyl)carbamoyl]propylthio]-4-keto-thieno[3,2-d]pyrimidin-3-yl]methyl]benzoic acid MLS-0435427.0001 | cid_4189667
Type:
Small organic molecule
Emp. Form.:
C24H20ClN3O4S2
Mol. Mass.:
514.016
SMILES:
CCC(Sc1nc2ccsc2c(=O)n1Cc1ccc(cc1)C(O)=O)C(=O)Nc1ccc(Cl)cc1
: