Target
Trans-activator protein BZLF1
Ligand
BDBM64842
Substrate
Meas. Tech.
Counterscreen for inhibitors of PP1: fluorescence-based biochemical high throughput dose response assay to identify inhibitors of Protein Phosphatase 5 (PP5)
IC50
57589±n/a nM
Citation
 PubChem, PC Counterscreen for inhibitors of PP1: fluorescence-based biochemical high throughput dose response assay to identify inhibitors of Protein Phosphatase 5 (PP5) PubChem Bioassay (2010)[AID] 
Target
Name:
Trans-activator protein BZLF1
Synonyms:
BZLF1 PPP5C protein
Type:
Enzyme Catalytic Domain
Mol. Mass.:
26856.37
Organism:
Human herpesvirus 4
Description:
gi_82503229
Residue:
245
  
Inhibitor
Name:
BDBM64842
Synonyms:
1-[4-(2-pyridin-2-ylpyrimidin-4-yl)phenyl]benzimidazole 1-[4-[2-(2-pyridyl)pyrimidin-4-yl]phenyl]benzimidazole MLS000541326 cid_1477836
Type:
Small organic molecule
Emp. Form.:
C22H15N5
Mol. Mass.:
349.388
SMILES:
c1nc2ccccc2n1-c1ccc(cc1)-c1ccnc(n1)-c1ccccn1
: