Target
Trans-activator protein BZLF1
Ligand
BDBM57567
Substrate
Meas. Tech.
Counterscreen for inhibitors of PP1: fluorescence-based biochemical high throughput dose response assay to identify inhibitors of Protein Phosphatase 5 (PP5)
IC50
>67047±n/a nM
Citation
 PubChem, PC Counterscreen for inhibitors of PP1: fluorescence-based biochemical high throughput dose response assay to identify inhibitors of Protein Phosphatase 5 (PP5) PubChem Bioassay (2010)[AID] 
Target
Name:
Trans-activator protein BZLF1
Synonyms:
BZLF1 PPP5C protein
Type:
Enzyme Catalytic Domain
Mol. Mass.:
26856.37
Organism:
Human herpesvirus 4
Description:
gi_82503229
Residue:
245
  
Inhibitor
Name:
BDBM57567
Synonyms:
MLS000589396 N-[(2,4-dimethoxyphenyl)methylideneamino]-2-(3,5-dimethylpyrazol-1-yl)-6-methyl-pyrimidin-4-amine N-[1-(2,4-Dimethoxy-phenyl)-meth-(E)-ylidene]-N'-[2-(3,5-dimethyl-pyrazol-1-yl)-6-methyl-pyrimidin-4-yl]-hydrazine [(2,4-dimethoxybenzylidene)amino]-[2-(3,5-dimethylpyrazol-1-yl)-6-methyl-pyrimidin-4-yl]amine | cid_5110992
Type:
Small organic molecule
Emp. Form.:
C19H22N6O2
Mol. Mass.:
366.417
SMILES:
COc1ccc(CN=Nc2cc(C)nc(n2)-n2nc(C)cc2C)c(OC)c1
: