Target
Trans-activator protein BZLF1
Ligand
BDBM57904
Substrate
Meas. Tech.
Counterscreen for inhibitors of PP1: fluorescence-based biochemical high throughput dose response assay to identify inhibitors of Protein Phosphatase 5 (PP5)
IC50
66842±n/a nM
Citation
 PubChem, PC Counterscreen for inhibitors of PP1: fluorescence-based biochemical high throughput dose response assay to identify inhibitors of Protein Phosphatase 5 (PP5) PubChem Bioassay (2010)[AID] 
Target
Name:
Trans-activator protein BZLF1
Synonyms:
BZLF1 PPP5C protein
Type:
Enzyme Catalytic Domain
Mol. Mass.:
26856.37
Organism:
Human herpesvirus 4
Description:
gi_82503229
Residue:
245
  
Inhibitor
Name:
BDBM57904
Synonyms:
5-methoxy-4-(2-methoxyphenyl)sulfanyl-2-pyridin-2-yl-pyrimidine 5-methoxy-4-[(2-methoxyphenyl)sulfanyl]-2-(2-pyridinyl)pyrimidine 5-methoxy-4-[(2-methoxyphenyl)thio]-2-(2-pyridyl)pyrimidine SMR000333892 | cid_1470741
Type:
Small organic molecule
Emp. Form.:
C17H15N3O2S
Mol. Mass.:
325.385
SMILES:
COc1ccccc1Sc1nc(ncc1OC)-c1ccccn1
: