Target
Trans-activator protein BZLF1
Ligand
BDBM54151
Substrate
Meas. Tech.
Counterscreen for inhibitors of PP1: fluorescence-based biochemical high throughput dose response assay to identify inhibitors of Protein Phosphatase 5 (PP5)
IC50
577.81±n/a nM
Citation
 PubChem, PC Counterscreen for inhibitors of PP1: fluorescence-based biochemical high throughput dose response assay to identify inhibitors of Protein Phosphatase 5 (PP5) PubChem Bioassay (2010)[AID] 
Target
Name:
Trans-activator protein BZLF1
Synonyms:
BZLF1 PPP5C protein
Type:
Enzyme Catalytic Domain
Mol. Mass.:
26856.37
Organism:
Human herpesvirus 4
Description:
gi_82503229
Residue:
245
  
Inhibitor
Name:
BDBM54151
Synonyms:
(2S)-2-[[(2S)-2-[[(2S)-2-[[(2S,3S)-3-amino-2-hydroxy-1-oxodecyl]-methylamino]-4-methylsulfinyl-1-oxobutyl]amino]-3-(4-hydroxyphenyl)-1-oxopropyl]amino]-3-(4-hydroxyphenyl)propanoic acid (2S)-2-[[(2S)-2-[[(2S)-2-[[(2S,3S)-3-amino-2-hydroxydecanoyl]-methylamino]-4-methylsulfinylbutanoyl]amino]-3-(4-hydroxyphenyl)propanoyl]amino]-3-(4-hydroxyphenyl)propanoic acid MLS000728323 cid_16746541 | microginin 690 revised
Type:
Small organic molecule
Emp. Form.:
C34H50N4O9S
Mol. Mass.:
690.847
SMILES:
CCCCCCC[C@H](N)[C@H](O)C(=O)N(C)[C@@H](CCS(C)=O)C(=O)N[C@@H](Cc1ccc(O)cc1)C(=O)N[C@@H](Cc1ccc(O)cc1)C(O)=O
: