Target
NADPH oxidase 1
Ligand
BDBM65849
Substrate
Meas. Tech.
Luminescence-based cell-based dose response assay to identify inhibitors of NADPH oxidase 1 (NOX1)
IC50
>20000±n/a nM
Citation
 PubChem, PC Luminescence-based cell-based dose response assay to identify inhibitors of NADPH oxidase 1 (NOX1) PubChem Bioassay (2010)[AID] 
Target
Name:
NADPH oxidase 1
Synonyms:
MOX-1 Mitogenic oxidase 1 NOH-1 NOX-1 NOX1_HUMAN
Type:
PROTEIN
Mol. Mass.:
64890.44
Organism:
Homo sapiens (Human)
Description:
ChEMBL_792877
Residue:
564
  
Inhibitor
Name:
BDBM65849
Synonyms:
N-[4-[(4-chlorophenyl)carbamoylamino]phenyl]-N-methyl-acetamide N-[4-[(4-chlorophenyl)carbamoylamino]phenyl]-N-methylacetamide SR-01000416457 cid_721945
Type:
Small organic molecule
Emp. Form.:
C16H16ClN3O2
Mol. Mass.:
317.77
SMILES:
CN(C(C)=O)c1ccc(NC(=O)Nc2ccc(Cl)cc2)cc1
: