Target
Vacuolar aminopeptidase 1
Ligand
BDBM66087
Substrate
Meas. Tech.
Dose Response of TOR pathway GFP-fusion proteins in Saccharomyes cerevisiae specifically LAP4 based on MLPCN hits
EC50
5335±n/a nM
Citation
 PubChem, PC Dose Response of TOR pathway GFP-fusion proteins in Saccharomyes cerevisiae specifically LAP4 based on MLPCN hits PubChem Bioassay (2010)[AID] 
Target
Name:
Vacuolar aminopeptidase 1
Synonyms:
AMPL_YEAST API YSC1
Type:
Enzyme Catalytic Domain
Mol. Mass.:
57084.90
Organism:
Saccharomyces cerevisiae
Description:
gi_486173
Residue:
514
  
Inhibitor
Name:
BDBM66087
Synonyms:
2-aminoethanol;6-cyclohexyl-1-hydroxy-4-methyl-2-pyridinone 2-aminoethanol;6-cyclohexyl-1-hydroxy-4-methylpyridin-2-one Ciclopirox MLS002153867 cid_38911
Type:
Small organic molecule
Emp. Form.:
C12H17NO2
Mol. Mass.:
207.2689
SMILES:
Cc1cc(C2CCCCC2)n(O)c(=O)c1
: