Target
Bcl-2-like protein 11
Ligand
BDBM66241
Substrate
Meas. Tech.
Luminescence Cell-Based Dose Retest to Identify Inhibitors of A1 Apoptosis
EC50
>350000±n/a nM
Citation
 PubChem, PC Luminescence Cell-Based Dose Retest to Identify Inhibitors of A1 Apoptosis PubChem Bioassay (2010)[AID] 
Target
Name:
Bcl-2-like protein 11
Synonyms:
B2L11_HUMAN BCL2L11 | BIM
Type:
PROTEIN
Mol. Mass.:
22175.26
Organism:
Homo sapiens (Human)
Description:
EBI_101325
Residue:
198
  
Inhibitor
Name:
BDBM66241
Synonyms:
5-[3-(4-fluorophenyl)-1-phenyl-4-pyrazolyl]imidazolidine-2,4-dione 5-[3-(4-fluorophenyl)-1-phenyl-pyrazol-4-yl]imidazolidine-2,4-dione MLS000036279 cid_660311
Type:
Small organic molecule
Emp. Form.:
C18H13FN4O2
Mol. Mass.:
336.3198
SMILES:
Fc1ccc(cc1)-c1nn(cc1C1NC(=O)NC1=O)-c1ccccc1
: