Target
Apelin receptor
Ligand
BDBM67175
Substrate
Meas. Tech.
Dose Response confirmation of uHTS hits from a small molecule antagonists of the APJ receptor via a luminescent beta-arrestin assay
IC50
3930±n/a nM
Citation
 PubChem, PC Dose Response confirmation of uHTS hits from a small molecule antagonists of the APJ receptor via a luminescent beta-arrestin assay PubChem Bioassay (2010)[AID] 
Target
Name:
Apelin receptor
Synonyms:
AGTRL1 APJ_HUMAN Angiotensin receptor-like 1 Apelin receptor (APJ) G-protein coupled receptor HG11
Type:
Enzyme Catalytic Domain
Mol. Mass.:
42664.06
Organism:
Homo sapiens (Human)
Description:
P35414
Residue:
380
  
Inhibitor
Name:
BDBM67175
Synonyms:
5-[(2,5-dichlorophenyl)hydrazo]-3,3-bis(hydroxymethyl)-2H-1,4-oxazin-6-one 5-[2-[2,5-bis(chloranyl)phenyl]hydrazinyl]-3,3-bis(hydroxymethyl)-2H-1,4-oxazin-6-one MLS000564083 cid_2313746
Type:
Small organic molecule
Emp. Form.:
C12H13Cl2N3O4
Mol. Mass.:
334.155
SMILES:
OCC1(CO)COC(=O)C(NNc2cc(Cl)ccc2Cl)=N1
: