Target
Apelin receptor
Ligand
BDBM54799
Substrate
Meas. Tech.
Dose Response confirmation of uHTS hits from a small molecule antagonists of the APJ receptor via a luminescent beta-arrestin assay
IC50
694±n/a nM
Citation
 PubChem, PC Dose Response confirmation of uHTS hits from a small molecule antagonists of the APJ receptor via a luminescent beta-arrestin assay PubChem Bioassay (2010)[AID] 
Target
Name:
Apelin receptor
Synonyms:
AGTRL1 APJ_HUMAN Angiotensin receptor-like 1 Apelin receptor (APJ) G-protein coupled receptor HG11
Type:
Enzyme Catalytic Domain
Mol. Mass.:
42664.06
Organism:
Homo sapiens (Human)
Description:
P35414
Residue:
380
  
Inhibitor
Name:
BDBM54799
Synonyms:
2-(2,3,4,5,6-pentafluorophenyl)-1-benzopyran-4-one 2-(2,3,4,5,6-pentafluorophenyl)chromone MLS000568955 cid_2055076
Type:
Small organic molecule
Emp. Form.:
C15H5F5O2
Mol. Mass.:
312.191
SMILES:
Fc1c(F)c(F)c(c(F)c1F)-c1cc(=O)c2ccccc2o1
: