Target
Apelin receptor
Ligand
BDBM67206
Substrate
Meas. Tech.
Dose Response confirmation of uHTS hits from a small molecule antagonists of the APJ receptor via a luminescent beta-arrestin assay
IC50
3290±n/a nM
Citation
 PubChem, PC Dose Response confirmation of uHTS hits from a small molecule antagonists of the APJ receptor via a luminescent beta-arrestin assay PubChem Bioassay (2010)[AID] 
Target
Name:
Apelin receptor
Synonyms:
AGTRL1 APJ_HUMAN Angiotensin receptor-like 1 Apelin receptor (APJ) G-protein coupled receptor HG11
Type:
Enzyme Catalytic Domain
Mol. Mass.:
42664.06
Organism:
Homo sapiens (Human)
Description:
P35414
Residue:
380
  
Inhibitor
Name:
BDBM67206
Synonyms:
2-(4-bromoanilino)-1-phenyl-ethanone 2-[(4-bromophenyl)amino]-1-phenyl-ethanone MLS000576651 cid_804442
Type:
Small organic molecule
Emp. Form.:
C14H12BrNO
Mol. Mass.:
290.155
SMILES:
Brc1ccc(NCC(=O)c2ccccc2)cc1
: