Target
Apelin receptor
Ligand
BDBM67256
Substrate
Meas. Tech.
Dose Response confirmation of uHTS hits from a small molecule antagonists of the APJ receptor via a luminescent beta-arrestin assay
IC50
2750±n/a nM
Citation
 PubChem, PC Dose Response confirmation of uHTS hits from a small molecule antagonists of the APJ receptor via a luminescent beta-arrestin assay PubChem Bioassay (2010)[AID] 
Target
Name:
Apelin receptor
Synonyms:
AGTRL1 APJ_HUMAN Angiotensin receptor-like 1 Apelin receptor (APJ) G-protein coupled receptor HG11
Type:
Enzyme Catalytic Domain
Mol. Mass.:
42664.06
Organism:
Homo sapiens (Human)
Description:
P35414
Residue:
380
  
Inhibitor
Name:
BDBM67256
Synonyms:
2-(4-fluoroanilino)-1-phenyl-ethanone;hydrobromide 2-[(4-fluorophenyl)amino]-1-phenyl-ethanone;hydrobromide SMR000230033 | cid_16188229
Type:
Small organic molecule
Emp. Form.:
C14H12FNO
Mol. Mass.:
229.2496
SMILES:
Fc1ccc(NCC(=O)c2ccccc2)cc1
: