Target
Apelin receptor
Ligand
BDBM52656
Substrate
Meas. Tech.
Dose Response confirmation of uHTS hits from a small molecule antagonists of the APJ receptor via a luminescent beta-arrestin assay
IC50
1270±n/a nM
Citation
 PubChem, PC Dose Response confirmation of uHTS hits from a small molecule antagonists of the APJ receptor via a luminescent beta-arrestin assay PubChem Bioassay (2010)[AID] 
Target
Name:
Apelin receptor
Synonyms:
AGTRL1 APJ_HUMAN Angiotensin receptor-like 1 Apelin receptor (APJ) G-protein coupled receptor HG11
Type:
Enzyme Catalytic Domain
Mol. Mass.:
42664.06
Organism:
Homo sapiens (Human)
Description:
P35414
Residue:
380
  
Inhibitor
Name:
BDBM52656
Synonyms:
1-[5-acetyl-3-methyl-6-(3-nitrophenyl)-5H-[1,2,4]triazolo[3,4-b][1,3,4]thiadiazin-7-yl]ethanone 1-[5-ethanoyl-3-methyl-6-(3-nitrophenyl)-[1,2,4]triazolo[3,4-b][1,3,4]thiadiazin-7-yl]ethanone SMR000312282 | cid_1511959
Type:
Small organic molecule
Emp. Form.:
C15H13N5O4S
Mol. Mass.:
359.36
SMILES:
CC(=O)[C-]1Sc2nn[c-](C)[n+]2[N+](C(C)=O)=C1c1cccc(c1)[N+]([O-])=O
: