Target
Apelin receptor
Ligand
BDBM67300
Substrate
Meas. Tech.
Dose Response confirmation of uHTS hits from a small molecule antagonists of the APJ receptor via a luminescent beta-arrestin assay
IC50
3930±n/a nM
Citation
 PubChem, PC Dose Response confirmation of uHTS hits from a small molecule antagonists of the APJ receptor via a luminescent beta-arrestin assay PubChem Bioassay (2010)[AID] 
Target
Name:
Apelin receptor
Synonyms:
AGTRL1 APJ_HUMAN Angiotensin receptor-like 1 Apelin receptor (APJ) G-protein coupled receptor HG11
Type:
Enzyme Catalytic Domain
Mol. Mass.:
42664.06
Organism:
Homo sapiens (Human)
Description:
P35414
Residue:
380
  
Inhibitor
Name:
BDBM67300
Synonyms:
MLS000860444 N'-(4-tert-butylphenyl)-4-methyl-1,2,3-thiadiazole-5-carbohydrazide N'-(4-tert-butylphenyl)-4-methyl-thiadiazole-5-carbohydrazide SMR000458528 | cid_2813088
Type:
Small organic molecule
Emp. Form.:
C14H18N4OS
Mol. Mass.:
290.384
SMILES:
Cc1nnsc1C(=O)NNc1ccc(cc1)C(C)(C)C
: