Target
Apelin receptor
Ligand
BDBM67364
Substrate
Meas. Tech.
Dose Response confirmation of uHTS hits from a small molecule antagonists of the APJ receptor via a luminescent beta-arrestin assay
IC50
2650±n/a nM
Citation
 PubChem, PC Dose Response confirmation of uHTS hits from a small molecule antagonists of the APJ receptor via a luminescent beta-arrestin assay PubChem Bioassay (2010)[AID] 
Target
Name:
Apelin receptor
Synonyms:
AGTRL1 APJ_HUMAN Angiotensin receptor-like 1 Apelin receptor (APJ) G-protein coupled receptor HG11
Type:
Enzyme Catalytic Domain
Mol. Mass.:
42664.06
Organism:
Homo sapiens (Human)
Description:
P35414
Residue:
380
  
Inhibitor
Name:
BDBM67364
Synonyms:
2-[[2-(2-furoylamino)acetyl]amino]acetic acid [2-(4-chloro-3-nitro-phenyl)-2-keto-ethyl] ester MLS001075738 [2-(4-chloranyl-3-nitro-phenyl)-2-oxidanylidene-ethyl] 2-[2-(furan-2-ylcarbonylamino)ethanoylamino]ethanoate cid_1593681
Type:
Small organic molecule
Emp. Form.:
C17H14ClN3O8
Mol. Mass.:
423.761
SMILES:
[O-][N+](=O)c1cc(ccc1Cl)C(=O)COC(=O)CNC(=O)CNC(=O)c1ccco1
: