Target
DNA damage-inducible transcript 3 protein
Ligand
BDBM49106
Substrate
Meas. Tech.
Dose-response primary assay and counterscreen assay for HTS small molecule inhibitors of CHOP to regulate the unfolded protein response to ER stress
IC50
9140±n/a nM
Citation
 PubChem, PC Dose-response primary assay and counterscreen assay for HTS small molecule inhibitors of CHOP to regulate the unfolded protein response to ER stress PubChem Bioassay (2010)[AID] 
Target
Name:
DNA damage-inducible transcript 3 protein
Synonyms:
Chop DDIT3_MOUSE Gadd153
Type:
Enzyme Catalytic Domain
Mol. Mass.:
19175.17
Organism:
Mus musculus
Description:
gi_160707929
Residue:
168
  
Inhibitor
Name:
BDBM49106
Synonyms:
7-[(E)-but-2-enyl]-3-methyl-8-(3-phenylpropylsulfanyl)purine-2,6-dione 7-[(E)-but-2-enyl]-3-methyl-8-(3-phenylpropylthio)xanthine SMR000015484 | cid_5310346
Type:
Small organic molecule
Emp. Form.:
C19H22N4O2S
Mol. Mass.:
370.469
SMILES:
C\C=C\Cn1c(SCCCc2ccccc2)nc2n(C)c(=O)[nH]c(=O)c12
: