Target
DNA damage-inducible transcript 3 protein
Ligand
BDBM63381
Substrate
Meas. Tech.
Dose-response primary assay and counterscreen assay for HTS small molecule inhibitors of CHOP to regulate the unfolded protein response to ER stress
IC50
9060±n/a nM
Citation
 PubChem, PC Dose-response primary assay and counterscreen assay for HTS small molecule inhibitors of CHOP to regulate the unfolded protein response to ER stress PubChem Bioassay (2010)[AID] 
Target
Name:
DNA damage-inducible transcript 3 protein
Synonyms:
Chop DDIT3_MOUSE Gadd153
Type:
Enzyme Catalytic Domain
Mol. Mass.:
19175.17
Organism:
Mus musculus
Description:
gi_160707929
Residue:
168
  
Inhibitor
Name:
BDBM63381
Synonyms:
(5Z)-3-[2-(5-amino-1,3,4-thiadiazol-2-yl)ethyl]-5-[4-(dimethylamino)benzylidene]thiazolidine-2,4-quinone (5Z)-3-[2-(5-amino-1,3,4-thiadiazol-2-yl)ethyl]-5-[[4-(dimethylamino)phenyl]methylidene]thiazolidine-2,4-dione MLS000402370 cid_1539603
Type:
Small organic molecule
Emp. Form.:
C16H17N5O2S2
Mol. Mass.:
375.468
SMILES:
CN(C)c1ccc(\C=C2/SC(=O)N(CCc3nnc(N)s3)C2=O)cc1
: