Target
DNA damage-inducible transcript 3 protein
Ligand
BDBM68194
Substrate
Meas. Tech.
Dose-response primary assay and counterscreen assay for HTS small molecule inhibitors of CHOP to regulate the unfolded protein response to ER stress
IC50
300±n/a nM
Citation
 PubChem, PC Dose-response primary assay and counterscreen assay for HTS small molecule inhibitors of CHOP to regulate the unfolded protein response to ER stress PubChem Bioassay (2010)[AID] 
Target
Name:
DNA damage-inducible transcript 3 protein
Synonyms:
Chop DDIT3_MOUSE Gadd153
Type:
Enzyme Catalytic Domain
Mol. Mass.:
19175.17
Organism:
Mus musculus
Description:
gi_160707929
Residue:
168
  
Inhibitor
Name:
BDBM68194
Synonyms:
3-[4-[(2,5-difluorobenzyl)amino]-3-nitro-phenyl]-3-[[2-(1-naphthyl)acetyl]amino]propionamide 3-[4-[(2,5-difluorophenyl)methylamino]-3-nitrophenyl]-3-[[2-(1-naphthalenyl)-1-oxoethyl]amino]propanamide MLS000420567 cid_16746181
Type:
Small organic molecule
Emp. Form.:
C28H24F2N4O4
Mol. Mass.:
518.5114
SMILES:
NC(=O)CC(NC(=O)Cc1cccc2ccccc12)c1ccc(NCc2cc(F)ccc2F)c(c1)[N+]([O-])=O
: