Target
Beta-hexosaminidase subunit alpha
Ligand
BDBM68269
Substrate
Meas. Tech.
Enzyme Inhibition Assay
Temperature
298.15±0 K
IC50
3.1e+4± 1.5e+4 nM
Citation
 Tropak, MBBlanchard, JEWithers, SGBrown, EDMahuran, D High-throughput screening for human lysosomal beta-N-Acetyl hexosaminidase inhibitors acting as pharmacological chaperones. Chem Biol 14:153-64 (2007)  
Target
Name:
Beta-hexosaminidase subunit alpha
Synonyms:
Beta-N-acetylhexosaminidase subunit alpha HEXA | HEXA_HUMAN
Type:
Protein
Mol. Mass.:
60688.46
Organism:
Homo sapiens (Human)
Description:
P06865
Residue:
529
  
Inhibitor
Name:
BDBM68269
Synonyms:
M-31867
Type:
Small organic molecule
Emp. Form.:
C16H15NO3
Mol. Mass.:
269.2952
SMILES:
CC(O)CCN1C(=O)c2cccc3cccc(C1=O)c23
: