Target
G-protein coupled receptor 35
Ligand
BDBM68310
Substrate
Meas. Tech.
SAR analysis of Antagonists of the GPR35 Receptor using an Image-Based Assay - Set 4
IC50
>32000±n/a nM
Citation
 PubChem, PC SAR analysis of Antagonists of the GPR35 Receptor using an Image-Based Assay - Set 4 PubChem Bioassay (2010)[AID] 
Target
Name:
G-protein coupled receptor 35
Synonyms:
G protein-coupled receptor 35 GPR35_HUMAN
Type:
Enzyme Catalytic Domain
Mol. Mass.:
34085.57
Organism:
Homo sapiens (Human)
Description:
gi_33695097
Residue:
309
  
Inhibitor
Name:
BDBM68310
Synonyms:
MLS-0435536.0001 N-(5-morpholin-4-ylsulfonyl-2-propan-2-yloxy-phenyl)-1-benzothiophene-2-carboxamide N-[5-(4-morpholinylsulfonyl)-2-propan-2-yloxyphenyl]-1-benzothiophene-2-carboxamide | cid_16282645
Type:
Small organic molecule
Emp. Form.:
C22H24N2O5S2
Mol. Mass.:
460.566
SMILES:
CC(C)Oc1ccc(cc1NC(=O)c1cc2ccccc2s1)S(=O)(=O)N1CCOCC1
: