Target
ATP-dependent molecular chaperone HSP82
Ligand
BDBM64600
Substrate
Meas. Tech.
Luminescence Cell-Based Secondary Assay to Identify Inhibitors of Hsp90
EC50
16540±n/a nM
Citation
 PubChem, PC Luminescence Cell-Based Secondary Assay to Identify Inhibitors of Hsp90 PubChem Bioassay (2010)[AID] 
Target
Name:
ATP-dependent molecular chaperone HSP82
Synonyms:
heat shock protein 90
Type:
Enzyme Catalytic Domain
Mol. Mass.:
80784.12
Organism:
Candida albicans
Description:
gi_994798
Residue:
707
  
Inhibitor
Name:
BDBM64600
Synonyms:
2-(2-chlorophenyl)-1-indolizinecarboxylic acid ethyl ester MLS000327611 cid_1491222 ethyl 2-(2-chlorophenyl)indolizine-1-carboxylate
Type:
Small organic molecule
Emp. Form.:
C17H14ClNO2
Mol. Mass.:
299.752
SMILES:
CCOC(=O)c1c(cn2ccccc12)-c1ccccc1Cl
: