Target
Glycogen synthase kinase-3 beta
Ligand
BDBM69062
Substrate
Meas. Tech.
Luminescence Cell-Free Homogeneous Dose Retest to Identify Inhibitors of Glycogen Synthase Kinase-3 beta Activity
EC50
>300000±n/a nM
Citation
 PubChem, PC Luminescence Cell-Free Homogeneous Dose Retest to Identify Inhibitors of Glycogen Synthase Kinase-3 beta Activity PubChem Bioassay (2010)[AID] 
Target
Name:
Glycogen synthase kinase-3 beta
Synonyms:
GSK-3 beta GSK3B Glycogen synthase kinase 3 beta (GSK3B) Glycogen synthase kinase-3 beta (GSK-3B) Glycogen synthase kinase-3 beta (GSK3B) Glycogen synthase kinase-3beta (GSK3B) | Serine/threonine-protein kinase GSK3B
Type:
Enzyme
Mol. Mass.:
46756.38
Organism:
Homo sapiens (Human)
Description:
P49841
Residue:
420
  
Inhibitor
Name:
BDBM69062
Synonyms:
6-(5-chloranyl-2-methoxy-phenyl)-N2-cyclohexyl-1,3,5-triazine-2,4-diamine 6-(5-chloro-2-methoxyphenyl)-N2-cyclohexyl-1,3,5-triazine-2,4-diamine N-[4-amino-6-(5-chloro-2-methoxyphenyl)-1,3,5-triazin-2-yl]-N-cyclohexylamine [4-amino-6-(5-chloro-2-methoxy-phenyl)-s-triazin-2-yl]-cyclohexyl-amine | cid_826987
Type:
Small organic molecule
Emp. Form.:
C16H20ClN5O
Mol. Mass.:
333.816
SMILES:
COc1ccc(Cl)cc1-c1nc(N)nc(NC2CCCCC2)n1
: