Target
Envelope glycoprotein gp160
Ligand
BDBM64817
Substrate
Meas. Tech.
SAR analysis of compounds that inhibit Human Immunodeficiency Virus Fusion.
IC50
8010±n/a nM
Citation
 PubChem, PC SAR analysis of compounds that inhibit Human Immunodeficiency Virus Fusion. PubChem Bioassay (2010)[AID] 
Target
Name:
Envelope glycoprotein gp160
Synonyms:
envelope glycoprotein
Type:
Enzyme Catalytic Domain
Mol. Mass.:
91798.58
Organism:
Human immunodeficiency virus 1
Description:
gi_45357394
Residue:
814
  
Inhibitor
Name:
BDBM64817
Synonyms:
4-[[2-[1-(3-chloro-4-methylanilino)-1-oxobutan-2-yl]sulfanyl-4-oxothieno[3,2-d]pyrimidin-3-yl]methyl]benzoic acid 4-[[2-[1-[(3-chloro-4-methyl-phenyl)carbamoyl]propylthio]-4-keto-thieno[3,2-d]pyrimidin-3-yl]methyl]benzoic acid MLS-0368938.0001 | cid_4189665
Type:
Small organic molecule
Emp. Form.:
C25H22ClN3O4S2
Mol. Mass.:
528.043
SMILES:
CCC(Sc1nc2ccsc2c(=O)n1Cc1ccc(cc1)C(O)=O)C(=O)Nc1ccc(C)c(Cl)c1
: