Target
Envelope glycoprotein gp160
Ligand
BDBM48024
Substrate
Meas. Tech.
SAR analysis of compounds that inhibit Human Immunodeficiency Virus Fusion.
IC50
25870±n/a nM
Citation
 PubChem, PC SAR analysis of compounds that inhibit Human Immunodeficiency Virus Fusion. PubChem Bioassay (2010)[AID] 
Target
Name:
Envelope glycoprotein gp160
Synonyms:
envelope glycoprotein
Type:
Enzyme Catalytic Domain
Mol. Mass.:
91798.58
Organism:
Human immunodeficiency virus 1
Description:
gi_45357394
Residue:
814
  
Inhibitor
Name:
BDBM48024
Synonyms:
2-chloranyl-5-[2-[[4-(2-fluorophenyl)carbonyloxy-3-methoxy-phenyl]methylidene]hydrazinyl]benzoic acid 2-chloro-5-[2-[[4-[(2-fluorophenyl)-oxomethoxy]-3-methoxyphenyl]methylidene]hydrazinyl]benzoic acid MLS001173789 cid_3525920
Type:
Small organic molecule
Emp. Form.:
C22H16ClFN2O5
Mol. Mass.:
442.824
SMILES:
COc1cc(CN=Nc2ccc(Cl)c(c2)C(O)=O)ccc1OC(=O)c1ccccc1F
: