Target
Envelope glycoprotein gp160
Ligand
BDBM48015
Substrate
Meas. Tech.
SAR analysis of compounds that inhibit Human Immunodeficiency Virus Fusion.
IC50
5160±n/a nM
Citation
 PubChem, PC SAR analysis of compounds that inhibit Human Immunodeficiency Virus Fusion. PubChem Bioassay (2010)[AID] 
Target
Name:
Envelope glycoprotein gp160
Synonyms:
envelope glycoprotein
Type:
Enzyme Catalytic Domain
Mol. Mass.:
91798.58
Organism:
Human immunodeficiency virus 1
Description:
gi_45357394
Residue:
814
  
Inhibitor
Name:
BDBM48015
Synonyms:
2-chloranyl-5-[2-[[3-methoxy-4-(4-methoxyphenyl)carbonyloxy-phenyl]methylidene]hydrazinyl]benzoic acid 2-chloro-5-[2-[[3-methoxy-4-[(4-methoxyphenyl)-oxomethoxy]phenyl]methylidene]hydrazinyl]benzoic acid MLS001173826 cid_3615873
Type:
Small organic molecule
Emp. Form.:
C23H19ClN2O6
Mol. Mass.:
454.86
SMILES:
COc1ccc(cc1)C(=O)Oc1ccc(CN=Nc2ccc(Cl)c(c2)C(O)=O)cc1OC
: