Target
Envelope glycoprotein gp160
Ligand
BDBM54037
Substrate
Meas. Tech.
SAR analysis of compounds that inhibit Human Immunodeficiency Virus Fusion.
IC50
5760±n/a nM
Citation
 PubChem, PC SAR analysis of compounds that inhibit Human Immunodeficiency Virus Fusion. PubChem Bioassay (2010)[AID] 
Target
Name:
Envelope glycoprotein gp160
Synonyms:
envelope glycoprotein
Type:
Enzyme Catalytic Domain
Mol. Mass.:
91798.58
Organism:
Human immunodeficiency virus 1
Description:
gi_45357394
Residue:
814
  
Inhibitor
Name:
BDBM54037
Synonyms:
(4Z)-2-(2,4-dimethylphenyl)-4-[[2-(5-keto-3-thioxo-2H-1,2,4-triazin-6-yl)anilino]methylene]isoquinoline-1,3-quinone (4Z)-2-(2,4-dimethylphenyl)-4-[[[2-(5-oxidanylidene-3-sulfanylidene-2H-1,2,4-triazin-6-yl)phenyl]amino]methylidene]isoquinoline-1,3-dione SMR000370443 | cid_5681738
Type:
Small organic molecule
Emp. Form.:
C27H21N5O3S
Mol. Mass.:
495.552
SMILES:
Cc1ccc(c(C)c1)-n1c(O)c(C=Nc2ccccc2-c2n[nH]c(=S)[nH]c2=O)c2ccccc2c1=O
: