Target
Envelope glycoprotein gp160
Ligand
BDBM70231
Substrate
Meas. Tech.
SAR analysis of compounds that inhibit Human Immunodeficiency Virus Fusion.
IC50
11500±n/a nM
Citation
 PubChem, PC SAR analysis of compounds that inhibit Human Immunodeficiency Virus Fusion. PubChem Bioassay (2010)[AID] 
Target
Name:
Envelope glycoprotein gp160
Synonyms:
envelope glycoprotein
Type:
Enzyme Catalytic Domain
Mol. Mass.:
91798.58
Organism:
Human immunodeficiency virus 1
Description:
gi_45357394
Residue:
814
  
Inhibitor
Name:
BDBM70231
Synonyms:
MLS-0362442.0001 [4-[(Z)-(5-azanylidene-3-ethylsulfonyl-7-oxidanylidene-[1,2,4]thiadiazolo[4,5-a]pyrimidin-6-ylidene)methyl]phenyl] benzenesulfonate benzenesulfonic acid [4-[(Z)-(3-ethylsulfonyl-5-imino-7-oxo-[1,2,4]thiadiazolo[4,5-a]pyrimidin-6-ylidene)methyl]phenyl] ester | cid_24816533
Type:
Small organic molecule
Emp. Form.:
C20H16N4O6S3
Mol. Mass.:
504.559
SMILES:
CCS(=O)(=O)C1=NSC2=NC(=O)\C(=C/c3ccc(OS(=O)(=O)c4ccccc4)cc3)C(=N)N12
: