Target
Envelope glycoprotein gp160
Ligand
BDBM48836
Substrate
Meas. Tech.
SAR analysis of compounds that inhibit Human Immunodeficiency Virus Fusion.
IC50
8590±n/a nM
Citation
 PubChem, PC SAR analysis of compounds that inhibit Human Immunodeficiency Virus Fusion. PubChem Bioassay (2010)[AID] 
Target
Name:
Envelope glycoprotein gp160
Synonyms:
envelope glycoprotein
Type:
Enzyme Catalytic Domain
Mol. Mass.:
91798.58
Organism:
Human immunodeficiency virus 1
Description:
gi_45357394
Residue:
814
  
Inhibitor
Name:
BDBM48836
Synonyms:
(5Z)-1-(4-fluorophenyl)-5-(3-furanylmethylidene)-2-sulfanylidene-1,3-diazinane-4,6-dione (5Z)-1-(4-fluorophenyl)-5-(furan-3-ylmethylidene)-2-sulfanylidene-1,3-diazinane-4,6-dione MLS000663960 cid_2288639
Type:
Small organic molecule
Emp. Form.:
C15H9FN2O3S
Mol. Mass.:
316.307
SMILES:
Fc1ccc(cc1)N1C(=S)NC(=O)C(=Cc2ccoc2)C1=O
: