Target
Amyloid-beta A4 precursor protein-binding family A member 1
Ligand
BDBM71562
Substrate
Meas. Tech.
SAR analysis of small molecule inhibitors of Mint-PDZ and N-type Ca2+ channel carboxyl-terminal peptide association using HTRF - Set 2
IC50
>56800±n/a nM
Citation
 PubChem, PC SAR analysis of small molecule inhibitors of Mint-PDZ and N-type Ca2+ channel carboxyl-terminal peptide association using HTRF - Set 2 PubChem Bioassay (2010)[AID] 
Target
Name:
Amyloid-beta A4 precursor protein-binding family A member 1
Synonyms:
APBA1_RAT Mint1 neuronal munc18-1 binding protein
Type:
Enzyme Catalytic Domain
Mol. Mass.:
92603.32
Organism:
Rattus norvegicus
Description:
gi_2625023
Residue:
839
  
Inhibitor
Name:
BDBM71562
Synonyms:
VU0410202-1 [2-(2-furyl)-4-quinolyl]-[4-(2-methoxyphenyl)piperazino]methanone;2,2,2-trifluoroacetic acid [2-(furan-2-yl)quinolin-4-yl]-[4-(2-methoxyphenyl)piperazin-1-yl]methanone;2,2,2-tris(fluoranyl)ethanoic acid | cid_44631809
Type:
Small organic molecule
Emp. Form.:
C25H23N3O3
Mol. Mass.:
413.4684
SMILES:
COc1ccccc1N1CCN(CC1)C(=O)c1cc(nc2ccccc12)-c1ccco1
: