Target
Heat shock factor protein 1
Ligand
BDBM34598
Substrate
Meas. Tech.
Luminescence Cell-Based Dose Retest to Identify Potentiators of Heat Shock Factor 1 (HSF1)
EC50
7626±n/a nM
Citation
 PubChem, PC Luminescence Cell-Based Dose Retest to Identify Potentiators of Heat Shock Factor 1 (HSF1) PubChem Bioassay (2010)[AID] 
Target
Name:
Heat shock factor protein 1
Synonyms:
HSF1_MOUSE Hsf1 protein
Type:
Enzyme Catalytic Domain
Mol. Mass.:
57208.68
Organism:
Mus musculus
Description:
P38532
Residue:
525
  
Inhibitor
Name:
BDBM34598
Synonyms:
MLS000094981 cid_3236301
Type:
Small organic molecule
Emp. Form.:
C9H6N6O4
Mol. Mass.:
262.1817
SMILES:
CCc1nc2c3no[n+]([O-])c3c3non(O)c3c2n1
: