Target
Protein RecA
Ligand
BDBM34598
Substrate
Meas. Tech.
Fluorescence Cell-Free Homogeneous Dose Retest to Identify Inhibitors of RecA-Intein Splicing Activity
EC50
337±n/a nM
Citation
 PubChem, PC Fluorescence Cell-Free Homogeneous Dose Retest to Identify Inhibitors of RecA-Intein Splicing Activity PubChem Bioassay (2010)[AID] 
Target
Name:
Protein RecA
Synonyms:
DNA recombination protein RecA recA
Type:
Enzyme Catalytic Domain
Mol. Mass.:
85386.52
Organism:
Mycobacterium tuberculosis H37Rv
Description:
gi_15609874
Residue:
790
  
Inhibitor
Name:
BDBM34598
Synonyms:
MLS000094981 cid_3236301
Type:
Small organic molecule
Emp. Form.:
C9H6N6O4
Mol. Mass.:
262.1817
SMILES:
CCc1nc2c3no[n+]([O-])c3c3non(O)c3c2n1
: