Target
Tyrosine-protein phosphatase non-receptor type 22
Ligand
BDBM74493
Substrate
Meas. Tech.
Dose Response confirmation of uHTS hits from a small molecule inhibitors of LYP via a fluorescence intensity assay - Set 2
IC50
>79400±0 nM
Citation
 PubChem, PC Dose Response confirmation of uHTS hits from a small molecule inhibitors of LYP via a fluorescence intensity assay - Set 2 PubChem Bioassay (2010)[AID] 
Target
Name:
Tyrosine-protein phosphatase non-receptor type 22
Synonyms:
3.1.3.48 LyP Lymphoid phosphatase (Lyp) PEST-domain phosphatase PTPN22 Tyrosine-protein phosphatase non-receptor type 22 (LYP) | tyrosine-protein phosphatase non-receptor type 22 isoform 1
Type:
Mol. Mass.:
91712.31
Organism:
Homo sapiens (Human)
Description:
Q9Y2R2
Residue:
807
  
Inhibitor
Name:
BDBM74493
Synonyms:
4-chloranyl-N-[2-oxidanylidene-2-[2,2,2-tris(fluoranyl)ethylamino]ethyl]benzamide 4-chloro-N-[2-oxo-2-(2,2,2-trifluoroethylamino)ethyl]benzamide SMR000264653 | cid_2576725
Type:
Small organic molecule
Emp. Form.:
C11H10ClF3N2O2
Mol. Mass.:
294.658
SMILES:
FC(F)(F)CNC(=O)CNC(=O)c1ccc(Cl)cc1
: