Target
Tyrosine-protein phosphatase non-receptor type 7
Ligand
BDBM74473
Substrate
Meas. Tech.
Dose Response confirmation of HTS hits from an HePTP Fluorescent Assay using OMFP substrate - Set 2
IC50
>79400±0 nM
Citation
 PubChem, PC Dose Response confirmation of HTS hits from an HePTP Fluorescent Assay using OMFP substrate - Set 2 PubChem Bioassay (2010)[AID] 
Target
Name:
Tyrosine-protein phosphatase non-receptor type 7
Synonyms:
He-PTP Hematopoietic protein-tyrosine phosphatase (HEPTP) PTPN7 Tyrosine-protein phosphatase non-receptor type 7 | Tyrosine-protein phosphatase non-receptor type 7 (HEPTP)
Type:
Protein
Mol. Mass.:
40530.79
Organism:
Homo sapiens (Human)
Description:
P35236
Residue:
360
  
Inhibitor
Name:
BDBM74473
Synonyms:
MLS000549501 N-(1-adamantyl)-3-[(4-bromo-3,5-dimethyl-1-pyrazolyl)methyl]benzamide N-(1-adamantyl)-3-[(4-bromo-3,5-dimethyl-pyrazol-1-yl)methyl]benzamide SMR000114783 | cid_4287298
Type:
Small organic molecule
Emp. Form.:
C23H28BrN3O
Mol. Mass.:
442.392
SMILES:
[H]C12CC3([H])CC([H])(C1)CC(C2)(C3)NC(=O)c1cccc(Cn2nc(C)c(Br)c2C)c1
: