Target
Muscarinic acetylcholine receptor M4
Ligand
BDBM48073
Substrate
Meas. Tech.
Discovery of a Highly Selective in vitro and in vivo M4 Positive Allosteric Modulator(PAM) : Activity with human M4
EC50
191.6±n/a nM
Citation
 PubChem, PC Discovery of a Highly Selective in vitro and in vivo M4 Positive Allosteric Modulator(PAM) : Activity with human M4 PubChem Bioassay (2010)[AID] 
Target
Name:
Muscarinic acetylcholine receptor M4
Synonyms:
ACM4_RAT Chrm-4 | Chrm4
Type:
Enzyme Catalytic Domain
Mol. Mass.:
52841.70
Organism:
RAT
Description:
Cholinergic, muscarinic M4 CHRM4 RAT::P08485
Residue:
477
  
Inhibitor
Name:
BDBM48073
Synonyms:
3-amino-N-tert-butyl-4-methyl-6-(2-morpholin-4-ylethoxy)thieno[2,3-b]pyridine-2-carboxamide 3-amino-N-tert-butyl-4-methyl-6-[2-(4-morpholinyl)ethoxy]-2-thieno[2,3-b]pyridinecarboxamide VU0359460 | cid_45142483
Type:
Small organic molecule
Emp. Form.:
C19H28N4O3S
Mol. Mass.:
392.516
SMILES:
Cc1cc(OCCN2CCOCC2)nc2sc(C(=O)NC(C)(C)C)c(N)c12
: