Target
Nuclear receptor subfamily 1 group I member 2
Ligand
BDBM75535
Substrate
Meas. Tech.
Luminescence-based counterscreen for activators of the Aryl Hydrocarbon Receptor (AHR): cell-based high throughput dose response screening assay for activators of the Pregnane X Receptor (PXR)
EC50
>116275±n/a nM
Citation
 PubChem, PC Luminescence-based counterscreen for activators of the Aryl Hydrocarbon Receptor (AHR): cell-based high throughput dose response screening assay for activators of the Pregnane X Receptor (PXR) PubChem Bioassay (2010)[AID] 
Target
Name:
Nuclear receptor subfamily 1 group I member 2
Synonyms:
NR1I2 Orphan nuclear receptor PAR1 PXR SXR nuclear receptor subfamily 1 group I member 2 isoform 1
Type:
Nuclear receptor
Mol. Mass.:
49774.77
Organism:
Homo sapiens (Human)
Description:
O75469
Residue:
434
  
Inhibitor
Name:
BDBM75535
Synonyms:
4-chloranyl-2-methyl-N-(5-methyl-1,3-thiazol-2-yl)pyrazole-3-carboxamide 4-chloro-2-methyl-N-(5-methyl-2-thiazolyl)-3-pyrazolecarboxamide MLS001071977 cid_6471003
Type:
Small organic molecule
Emp. Form.:
C9H9ClN4OS
Mol. Mass.:
256.712
SMILES:
Cc1cnc(NC(=O)c2c(Cl)cnn2C)s1
: