Target
Insulin-degrading enzyme
Ligand
BDBM63381
Substrate
Meas. Tech.
Dose Response: Fluorescence polarization-based cell-based high throughput dose response assay for inhibitors of insulin-degrading enzyme (IDE)
IC50
>55935±n/a nM
Citation
 PubChem, PC Dose Response: Fluorescence polarization-based cell-based high throughput dose response assay for inhibitors of insulin-degrading enzyme (IDE) PubChem Bioassay (2010)[AID] 
Target
Name:
Insulin-degrading enzyme
Synonyms:
Abeta-degrading protease IDE Insulin degrading enzyme (hIDE) Insulin-degrading enzyme Insulysin | insulin-degrading enzyme isoform 1 precursor
Type:
Enzyme Catalytic Domain
Mol. Mass.:
117968.59
Organism:
Homo sapiens (Human)
Description:
P14735
Residue:
1019
  
Inhibitor
Name:
BDBM63381
Synonyms:
(5Z)-3-[2-(5-amino-1,3,4-thiadiazol-2-yl)ethyl]-5-[4-(dimethylamino)benzylidene]thiazolidine-2,4-quinone (5Z)-3-[2-(5-amino-1,3,4-thiadiazol-2-yl)ethyl]-5-[[4-(dimethylamino)phenyl]methylidene]thiazolidine-2,4-dione MLS000402370 cid_1539603
Type:
Small organic molecule
Emp. Form.:
C16H17N5O2S2
Mol. Mass.:
375.468
SMILES:
CN(C)c1ccc(\C=C2/SC(=O)N(CCc3nnc(N)s3)C2=O)cc1
: