Target
Insulin-degrading enzyme
Ligand
BDBM75716
Substrate
Meas. Tech.
Dose Response: Fluorescence polarization-based cell-based high throughput dose response assay for inhibitors of insulin-degrading enzyme (IDE)
IC50
12830±n/a nM
Citation
 PubChem, PC Dose Response: Fluorescence polarization-based cell-based high throughput dose response assay for inhibitors of insulin-degrading enzyme (IDE) PubChem Bioassay (2010)[AID] 
Target
Name:
Insulin-degrading enzyme
Synonyms:
Abeta-degrading protease IDE Insulin degrading enzyme (hIDE) Insulin-degrading enzyme Insulysin | insulin-degrading enzyme isoform 1 precursor
Type:
Enzyme Catalytic Domain
Mol. Mass.:
117968.59
Organism:
Homo sapiens (Human)
Description:
P14735
Residue:
1019
  
Inhibitor
Name:
BDBM75716
Synonyms:
(E)-2-cyano-3-[4-(dimethylamino)phenyl]-2-propenoic acid [1-[methyl-(phenylmethyl)amino]-1-oxopropan-2-yl] ester MLS001080957 [1-[benzyl(methyl)amino]-1-oxopropan-2-yl] (E)-2-cyano-3-[4-(dimethylamino)phenyl]prop-2-enoate cid_24819659
Type:
Small organic molecule
Emp. Form.:
C23H25N3O3
Mol. Mass.:
391.4629
SMILES:
CC(OC(=O)C(=C\c1ccc(cc1)N(C)C)\C#N)C(=O)N(C)Cc1ccccc1
: