Target
Intestinal-type alkaline phosphatase 1
Ligand
BDBM50241354
Substrate
Meas. Tech.
Dose Response confirmation of uHTS hits from a small molecule inhibitors of mouse intestinal alkaline phosphatase via a luminescent assay
IC50
1660±n/a nM
Citation
 PubChem, PC Dose Response confirmation of uHTS hits from a small molecule inhibitors of mouse intestinal alkaline phosphatase via a luminescent assay PubChem Bioassay (2010)[AID] 
Target
Name:
Intestinal-type alkaline phosphatase 1
Synonyms:
Alpi | PPBI1_RAT
Type:
Enzyme Catalytic Domain
Mol. Mass.:
58396.39
Organism:
Rattus norvegicus (Rat)
Description:
P15693
Residue:
540
  
Inhibitor
Name:
BDBM50241354
Synonyms:
2-(3,4-Dihydroxy-phenyl)-5,7-dihydroxy-3-(3,4,5-trihydroxy-6-hydroxymethyl-tetrahydro-pyran-2-yloxy)-chromen-4-one 2-(3,4-dihydroxyphenyl)-5,7-dihydroxy-3-((2S,3R,4S,5S,6R)-3,4,5-trihydroxy-6-(hydroxymethyl)-tetrahydro-2H-pyran-2-yloxy)-4H-chromen-4-one 3,3',4',5,7-pentahydroxyflavone-3-beta-O-glucoside CHEMBL250450 Hyperoside Quercetin 3-O-beta-D-glucoside Quercetin-3-glucoside cid_5378597 hydroside isoquercetrin quercetin 3-O-beta-D-galactopyranoside quercetin 3-O-galactoside quercetin 3-O-glucoside | quercetin-3-galactoside
Type:
Small organic molecule
Emp. Form.:
C21H20O12
Mol. Mass.:
464.3763
SMILES:
OC[C@H]1O[C@@H](Oc2c(O)c3c(cc(O)cc3=O)oc2-c2ccc(O)c(O)c2)[C@H](O)[C@@H](O)[C@@H]1O
: