Target
Intestinal-type alkaline phosphatase 1
Ligand
BDBM54641
Substrate
Meas. Tech.
Dose Response confirmation of uHTS hits from a small molecule inhibitors of mouse intestinal alkaline phosphatase via a luminescent assay
IC50
6020±n/a nM
Citation
 PubChem, PC Dose Response confirmation of uHTS hits from a small molecule inhibitors of mouse intestinal alkaline phosphatase via a luminescent assay PubChem Bioassay (2010)[AID] 
Target
Name:
Intestinal-type alkaline phosphatase 1
Synonyms:
Alpi | PPBI1_RAT
Type:
Enzyme Catalytic Domain
Mol. Mass.:
58396.39
Organism:
Rattus norvegicus (Rat)
Description:
P15693
Residue:
540
  
Inhibitor
Name:
BDBM54641
Synonyms:
4-[3-(2-chlorophenyl)-5-(4-methoxyphenyl)-2-pyrazolin-1-yl]benzenesulfonamide KUC103416N cid_42628052
Type:
Small organic molecule
Emp. Form.:
C22H20ClN3O3S
Mol. Mass.:
441.931
SMILES:
COc1ccc(cc1)C1CC(=NN1c1ccc(cc1)S(N)(=O)=O)c1ccccc1Cl
: