Target
Mu-type opioid receptor
Ligand
BDBM75374
Substrate
Meas. Tech.
SAR Analysis of Agonists of the MOR Receptor using an Image-Based Assay - Set 3
EC50
>32000±n/a nM
Citation
 PubChem, PC SAR Analysis of Agonists of the MOR Receptor using an Image-Based Assay - Set 3 PubChem Bioassay (2010)[AID] 
Target
Name:
Mu-type opioid receptor
Synonyms:
M-OR-1 MOR-1 MUOR1 Mu opiate receptor OPRM1 hMOP | mu-type opioid receptor isoform MOR-1
Type:
G Protein-Coupled Receptor (GPCR)
Mol. Mass.:
44789.51
Organism:
Homo sapiens (Human)
Description:
P35372
Residue:
400
  
Inhibitor
Name:
BDBM75374
Synonyms:
4-[[4-(furan-2-ylmethyl)-5-pyridin-2-yl-1,2,4-triazol-3-yl]sulfanylmethyl]benzenecarbonitrile 4-[[[4-(2-furanylmethyl)-5-(2-pyridinyl)-1,2,4-triazol-3-yl]thio]methyl]benzonitrile KSC-5-287B2 cid_44620930
Type:
Small organic molecule
Emp. Form.:
C20H15N5OS
Mol. Mass.:
373.431
SMILES:
N#Cc1ccc(CSc2nnc(-c3ccccn3)n2Cc2ccco2)cc1
: