Target
Mu-type opioid receptor
Ligand
BDBM75379
Substrate
Meas. Tech.
SAR Analysis of Agonists of the MOR Receptor using an Image-Based Assay - Set 3
EC50
>32000±n/a nM
Citation
 PubChem, PC SAR Analysis of Agonists of the MOR Receptor using an Image-Based Assay - Set 3 PubChem Bioassay (2010)[AID] 
Target
Name:
Mu-type opioid receptor
Synonyms:
M-OR-1 MOR-1 MUOR1 Mu opiate receptor OPRM1 hMOP | mu-type opioid receptor isoform MOR-1
Type:
G Protein-Coupled Receptor (GPCR)
Mol. Mass.:
44789.51
Organism:
Homo sapiens (Human)
Description:
P35372
Residue:
400
  
Inhibitor
Name:
BDBM75379
Synonyms:
2-[4-(2-furanylmethyl)-5-[(2-methylphenyl)methylthio]-1,2,4-triazol-3-yl]pyridine 2-[4-(furan-2-ylmethyl)-5-[(2-methylphenyl)methylsulfanyl]-1,2,4-triazol-3-yl]pyridine KUC104182N | cid_16447357
Type:
Small organic molecule
Emp. Form.:
C20H18N4OS
Mol. Mass.:
362.448
SMILES:
Cc1ccccc1CSc1nnc(-c2ccccn2)n1Cc1ccco1
: