Target
Mu-type opioid receptor
Ligand
BDBM75386
Substrate
Meas. Tech.
SAR Analysis of Agonists of the MOR Receptor using an Image-Based Assay - Set 3
EC50
>32000±n/a nM
Citation
 PubChem, PC SAR Analysis of Agonists of the MOR Receptor using an Image-Based Assay - Set 3 PubChem Bioassay (2010)[AID] 
Target
Name:
Mu-type opioid receptor
Synonyms:
M-OR-1 MOR-1 MUOR1 Mu opiate receptor OPRM1 hMOP | mu-type opioid receptor isoform MOR-1
Type:
G Protein-Coupled Receptor (GPCR)
Mol. Mass.:
44789.51
Organism:
Homo sapiens (Human)
Description:
P35372
Residue:
400
  
Inhibitor
Name:
BDBM75386
Synonyms:
2-[5-[[4-fluoranyl-2-(trifluoromethyl)phenyl]methylsulfanyl]-4-(furan-2-ylmethyl)-1,2,4-triazol-3-yl]pyridine 2-[5-[[4-fluoro-2-(trifluoromethyl)phenyl]methylsulfanyl]-4-(furan-2-ylmethyl)-1,2,4-triazol-3-yl]pyridine KSC-5-287D2 cid_44620935
Type:
Small organic molecule
Emp. Form.:
C20H14F4N4OS
Mol. Mass.:
434.41
SMILES:
Fc1ccc(CSc2nnc(-c3ccccn3)n2Cc2ccco2)c(c1)C(F)(F)F
: