Target
Mu-type opioid receptor
Ligand
BDBM75396
Substrate
Meas. Tech.
SAR Analysis of Agonists of the MOR Receptor using an Image-Based Assay - Set 3
EC50
>32000±n/a nM
Citation
 PubChem, PC SAR Analysis of Agonists of the MOR Receptor using an Image-Based Assay - Set 3 PubChem Bioassay (2010)[AID] 
Target
Name:
Mu-type opioid receptor
Synonyms:
M-OR-1 MOR-1 MUOR1 Mu opiate receptor OPRM1 hMOP | mu-type opioid receptor isoform MOR-1
Type:
G Protein-Coupled Receptor (GPCR)
Mol. Mass.:
44789.51
Organism:
Homo sapiens (Human)
Description:
P35372
Residue:
400
  
Inhibitor
Name:
BDBM75396
Synonyms:
2-[5-[(2-methyl-3-nitro-benzyl)thio]-4-(2-thenyl)-1,2,4-triazol-3-yl]pyridine 2-[5-[(2-methyl-3-nitrophenyl)methylsulfanyl]-4-(thiophen-2-ylmethyl)-1,2,4-triazol-3-yl]pyridine KSC-5-289E9 cid_44620917
Type:
Small organic molecule
Emp. Form.:
C20H17N5O2S2
Mol. Mass.:
423.511
SMILES:
Cc1c(CSc2nnc(-c3ccccn3)n2Cc2cccs2)cccc1[N+]([O-])=O
: