Target
Mu-type opioid receptor
Ligand
BDBM75399
Substrate
Meas. Tech.
SAR Analysis of Agonists of the MOR Receptor using an Image-Based Assay - Set 3
EC50
>32000±n/a nM
Citation
 PubChem, PC SAR Analysis of Agonists of the MOR Receptor using an Image-Based Assay - Set 3 PubChem Bioassay (2010)[AID] 
Target
Name:
Mu-type opioid receptor
Synonyms:
M-OR-1 MOR-1 MUOR1 Mu opiate receptor OPRM1 hMOP | mu-type opioid receptor isoform MOR-1
Type:
G Protein-Coupled Receptor (GPCR)
Mol. Mass.:
44789.51
Organism:
Homo sapiens (Human)
Description:
P35372
Residue:
400
  
Inhibitor
Name:
BDBM75399
Synonyms:
2-[4-(2-thenyl)-5-[(2,3,4-trifluorobenzyl)thio]-1,2,4-triazol-3-yl]pyridine 2-[4-(thiophen-2-ylmethyl)-5-[(2,3,4-trifluorophenyl)methylthio]-1,2,4-triazol-3-yl]pyridine KSC-5-289F12 cid_44620921
Type:
Small organic molecule
Emp. Form.:
C19H13F3N4S2
Mol. Mass.:
418.459
SMILES:
Fc1ccc(CSc2nnc(-c3ccccn3)n2Cc2cccs2)c(F)c1F
: