Target
Phosphorylase b kinase regulatory subunit alpha, skeletal muscle isoform
Ligand
BDBM2681
Substrate
Phosphorylase b
Meas. Tech.
Phosphorylase Kinasse Assay
pH
7±n/a
Temperature
303.15±n/a K
IC50
1700±200 nM
Citation
 Toullec, DPianetti, PCoste, HBellevergue, PGrand-Perret, TAjakane, MBaudet, VBoissin, PBoursier, ELoriolle, F The bisindolylmaleimide GF 109203X is a potent and selective inhibitor of protein kinase C. J Biol Chem 266:15771-81 (1991) Target
Name:
Phosphorylase b kinase regulatory subunit alpha, skeletal muscle isoform
Synonyms:
KPB1_RABIT Phosphorylase Kinase
Type:
Enzyme Complex
Mol. Mass.:
138403.25
Organism:
Oryctolagus cuniculus (rabbit)
Description:
The enzyme is a hexadecamer of four types of subunits:alpha(4)beta(4)gamma(4)delta(4) isolated from skeletal muscle of rabbits.
Residue:
1237
  
Inhibitor
Name:
BDBM2681
Synonyms:
3-{1-[3-(dimethylamino)propyl]-1H-indol-3-yl}-4-(1-methyl-1H-indol-3-yl)-2,5-dihydro-1H-pyrrole-2,5-dione CHEMBL268769
Type:
Small organic molecule
Emp. Form.:
C26H26N4O2
Mol. Mass.:
426.5102
SMILES:
CN(C)CCCn1cc(C2=C(C(=O)NC2=O)c2cn(C)c3ccccc23)c2ccccc12
:
Substrate
Name:
Phosphorylase b
Synonyms:
Type:
Peptide
Mol. Mass.:
1157.29
Organism:
Description:
250 uM [gamma-32P]ATP as co-substrate.
Residue:
12
ISVGLAGVENVT