Target
NACHT, LRR and PYD domains-containing protein 1
Ligand
BDBM76314
Substrate
Meas. Tech.
Dose Response confirmation of uHTS for the identification of inhibitors of NALP1 in yeast using a luminescent assay
IC50
22600±n/a nM
Citation
 PubChem, PC Dose Response confirmation of uHTS for the identification of inhibitors of NALP1 in yeast using a luminescent assay PubChem Bioassay (2010)[AID] 
Target
Name:
NACHT, LRR and PYD domains-containing protein 1
Synonyms:
CARD7 KIAA0926 NACHT, LRR and PYD domains-containing protein 1 isoform 1 NLRP1 | NLRP1_HUMAN
Type:
Enzyme Catalytic Domain
Mol. Mass.:
165873.33
Organism:
Homo sapiens (Human)
Description:
Q9C000
Residue:
1473
  
Inhibitor
Name:
BDBM76314
Synonyms:
2-(4-isopropoxyanilino)-N-(p-tolyl)acetamide N-(4-methylphenyl)-2-(4-propan-2-yloxyanilino)acetamide N~2~-(4-isopropoxyphenyl)-N~1~-(4-methylphenyl)glycinamide cid_725331
Type:
Small organic molecule
Emp. Form.:
C18H22N2O2
Mol. Mass.:
298.3795
SMILES:
CC(C)Oc1ccc(NCC(=O)Nc2ccc(C)cc2)cc1
: